{"text_format":"1","workbook":"xlsx","n_sheets":3,"sheets":["発注書","list","ﾌﾞﾛｯｸ解除方法"],"not_rendered":{"charts":0,"images":2,"macros":1,"external_links":0,"defined_names":0,"comments":0,"pivot_tables":0},"unopened":[],"bounds":{"document_bytes":16777216,"sheet_cells":100000,"rows_first":2000,"rows_last":500,"rows_between":2000,"halvings":0,"cell_chars":16384,"cell_head_chars":4096},"cells_cut":0,"cells_raw":0,"read":"whole","date_system":"1900"}

{"sheet":"発注書","index":0,"n_rows":35,"n_cols":8,"rows_kept":35,"cut":false,"hidden":false,"merged":[[34,4,34,6],[29,2,29,3],[1,0,1,6],[2,5,2,6],[3,5,3,6],[32,4,32,6],[33,4,33,6],[32,2,32,3],[33,2,33,3],[34,2,34,3]]}
[]
["発　注　書"]
[null,null,null,null,"日付"]
["ザリーンジャパン株式会社",null,null,null,"No."]
["tel : 03-5631-6101 fax : 03-5631-6120"]
["※発注書は随時更新されます。一定期間が経ちましたら再度ダウンロードをお願い致します。",null,null,null,null,"お取引掛率をご入力下さい(％)。"]
[null,"商品ｺｰﾄﾞ(listからｺﾋﾟｰ貼付可)と数量をご入力下さい(半角) 。ﾌｧｯｸｽ又は担当者へmailにてお送りください。"]
[null,"←ｺｰﾄﾞ検索をｸﾘｯｸで検索できます(ﾏｸﾛがﾌﾞﾛｯｸされた場合はﾌﾞﾛｯｸ解除方法をご参照ください）。",null,null,null,null,null,"廃盤の　　お知らせ"]
["商品コード","商品名","上代価格","発注単位","数量","単価","金額","×廃盤在無　△廃盤在有　"]
[null,{"$f":"IF(A10=\"\",\"\",VLOOKUP(A10,list!$A:$C,2,FALSE))","v":""},{"$f":"IF(A10=\"\",\"\",VLOOKUP(A10,list!$A:$C,3,FALSE))","v":""},{"$f":"IF(A10=\"\",\"\",VLOOKUP(A10,list!$A:$D,4,FALSE))","v":""},null,{"$f":"IF(C10=\"\",\"\",C10*$F$7)","v":""},{"$f":"IF(E10=0,\"\",(E10*F10))","v":""},{"$f":"IF(A10=\"\",\"\",VLOOKUP(A10,list!$A:$G,7,FALSE))&\"\"","v":""}]
[null,{"$f":"IF(A11=\"\",\"\",VLOOKUP(A11,list!$A:$C,2,FALSE))","v":""},{"$f":"IF(A11=\"\",\"\",VLOOKUP(A11,list!$A:$C,3,FALSE))","v":""},{"$f":"IF(A11=\"\",\"\",VLOOKUP(A11,list!$A:$D,4,FALSE))","v":""},null,{"$f":"IF(C11=\"\",\"\",C11*$F$7)","v":""},"",{"$f":"IF(A11=\"\",\"\",VLOOKUP(A11,list!$A:$G,7,FALSE))&\"\"","v":""}]
[null,{"$f":"IF(A12=\"\",\"\",VLOOKUP(A12,list!$A:$C,2,FALSE))","v":""},{"$f":"IF(A12=\"\",\"\",VLOOKUP(A12,list!$A:$C,3,FALSE))","v":""},{"$f":"IF(A12=\"\",\"\",VLOOKUP(A12,list!$A:$D,4,FALSE))","v":""},null,"","",{"$f":"IF(A12=\"\",\"\",VLOOKUP(A12,list!$A:$G,7,FALSE))&\"\"","v":""}]
[null,{"$f":"IF(A13=\"\",\"\",VLOOKUP(A13,list!$A:$C,2,FALSE))","v":""},{"$f":"IF(A13=\"\",\"\",VLOOKUP(A13,list!$A:$C,3,FALSE))","v":""},{"$f":"IF(A13=\"\",\"\",VLOOKUP(A13,list!$A:$D,4,FALSE))","v":""},null,"","",{"$f":"IF(A13=\"\",\"\",VLOOKUP(A13,list!$A:$G,7,FALSE))&\"\"","v":""}]
[null,{"$f":"IF(A14=\"\",\"\",VLOOKUP(A14,list!$A:$C,2,FALSE))","v":""},{"$f":"IF(A14=\"\",\"\",VLOOKUP(A14,list!$A:$C,3,FALSE))","v":""},{"$f":"IF(A14=\"\",\"\",VLOOKUP(A14,list!$A:$D,4,FALSE))","v":""},null,"","",{"$f":"IF(A14=\"\",\"\",VLOOKUP(A14,list!$A:$G,7,FALSE))&\"\"","v":""}]
[null,{"$f":"IF(A15=\"\",\"\",VLOOKUP(A15,list!$A:$C,2,FALSE))","v":""},{"$f":"IF(A15=\"\",\"\",VLOOKUP(A15,list!$A:$C,3,FALSE))","v":""},{"$f":"IF(A15=\"\",\"\",VLOOKUP(A15,list!$A:$D,4,FALSE))","v":""},null,{"$f":"IF(C15=\"\",\"\",C15*$F$7)","v":""},{"$f":"IF(E15=0,\"\",(E15*F15))","v":""},{"$f":"IF(A15=\"\",\"\",VLOOKUP(A15,list!$A:$G,7,FALSE))&\"\"","v":""}]
[null,{"$f":"IF(A16=\"\",\"\",VLOOKUP(A16,list!$A:$C,2,FALSE))","v":""},{"$f":"IF(A16=\"\",\"\",VLOOKUP(A16,list!$A:$C,3,FALSE))","v":""},{"$f":"IF(A16=\"\",\"\",VLOOKUP(A16,list!$A:$D,4,FALSE))","v":""},null,"","",{"$f":"IF(A16=\"\",\"\",VLOOKUP(A16,list!$A:$G,7,FALSE))&\"\"","v":""}]
[null,{"$f":"IF(A17=\"\",\"\",VLOOKUP(A17,list!$A:$C,2,FALSE))","v":""},{"$f":"IF(A17=\"\",\"\",VLOOKUP(A17,list!$A:$C,3,FALSE))","v":""},{"$f":"IF(A17=\"\",\"\",VLOOKUP(A17,list!$A:$D,4,FALSE))","v":""},null,"","",{"$f":"IF(A17=\"\",\"\",VLOOKUP(A17,list!$A:$G,7,FALSE))&\"\"","v":""}]
[null,{"$f":"IF(A18=\"\",\"\",VLOOKUP(A18,list!$A:$C,2,FALSE))","v":""},{"$f":"IF(A18=\"\",\"\",VLOOKUP(A18,list!$A:$C,3,FALSE))","v":""},{"$f":"IF(A18=\"\",\"\",VLOOKUP(A18,list!$A:$D,4,FALSE))","v":""},null,"","",{"$f":"IF(A18=\"\",\"\",VLOOKUP(A18,list!$A:$G,7,FALSE))&\"\"","v":""}]
[null,{"$f":"IF(A19=\"\",\"\",VLOOKUP(A19,list!$A:$C,2,FALSE))","v":""},{"$f":"IF(A19=\"\",\"\",VLOOKUP(A19,list!$A:$C,3,FALSE))","v":""},{"$f":"IF(A19=\"\",\"\",VLOOKUP(A19,list!$A:$D,4,FALSE))","v":""},null,"","",{"$f":"IF(A19=\"\",\"\",VLOOKUP(A19,list!$A:$G,7,FALSE))&\"\"","v":""}]
[null,{"$f":"IF(A20=\"\",\"\",VLOOKUP(A20,list!$A:$C,2,FALSE))","v":""},{"$f":"IF(A20=\"\",\"\",VLOOKUP(A20,list!$A:$C,3,FALSE))","v":""},{"$f":"IF(A20=\"\",\"\",VLOOKUP(A20,list!$A:$D,4,FALSE))","v":""},null,"","",{"$f":"IF(A20=\"\",\"\",VLOOKUP(A20,list!$A:$G,7,FALSE))&\"\"","v":""}]
[null,{"$f":"IF(A21=\"\",\"\",VLOOKUP(A21,list!$A:$C,2,FALSE))","v":""},{"$f":"IF(A21=\"\",\"\",VLOOKUP(A21,list!$A:$C,3,FALSE))","v":""},{"$f":"IF(A21=\"\",\"\",VLOOKUP(A21,list!$A:$D,4,FALSE))","v":""},null,"","",{"$f":"IF(A21=\"\",\"\",VLOOKUP(A21,list!$A:$G,7,FALSE))&\"\"","v":""}]
[null,{"$f":"IF(A22=\"\",\"\",VLOOKUP(A22,list!$A:$C,2,FALSE))","v":""},{"$f":"IF(A22=\"\",\"\",VLOOKUP(A22,list!$A:$C,3,FALSE))","v":""},{"$f":"IF(A22=\"\",\"\",VLOOKUP(A22,list!$A:$D,4,FALSE))","v":""},null,"","",{"$f":"IF(A22=\"\",\"\",VLOOKUP(A22,list!$A:$G,7,FALSE))&\"\"","v":""}]
[null,{"$f":"IF(A23=\"\",\"\",VLOOKUP(A23,list!$A:$C,2,FALSE))","v":""},{"$f":"IF(A23=\"\",\"\",VLOOKUP(A23,list!$A:$C,3,FALSE))","v":""},{"$f":"IF(A23=\"\",\"\",VLOOKUP(A23,list!$A:$D,4,FALSE))","v":""},null,"","",{"$f":"IF(A23=\"\",\"\",VLOOKUP(A23,list!$A:$G,7,FALSE))&\"\"","v":""}]
[null,{"$f":"IF(A24=\"\",\"\",VLOOKUP(A24,list!$A:$C,2,FALSE))","v":""},{"$f":"IF(A24=\"\",\"\",VLOOKUP(A24,list!$A:$C,3,FALSE))","v":""},{"$f":"IF(A24=\"\",\"\",VLOOKUP(A24,list!$A:$D,4,FALSE))","v":""},null,"","",{"$f":"IF(A24=\"\",\"\",VLOOKUP(A24,list!$A:$G,7,FALSE))&\"\"","v":""}]
[null,{"$f":"IF(A25=\"\",\"\",VLOOKUP(A25,list!$A:$C,2,FALSE))","v":""},{"$f":"IF(A25=\"\",\"\",VLOOKUP(A25,list!$A:$C,3,FALSE))","v":""},{"$f":"IF(A25=\"\",\"\",VLOOKUP(A25,list!$A:$D,4,FALSE))","v":""},null,"","",{"$f":"IF(A25=\"\",\"\",VLOOKUP(A25,list!$A:$G,7,FALSE))&\"\"","v":""}]
[null,{"$f":"IF(A26=\"\",\"\",VLOOKUP(A26,list!$A:$C,2,FALSE))","v":""},{"$f":"IF(A26=\"\",\"\",VLOOKUP(A26,list!$A:$C,3,FALSE))","v":""},{"$f":"IF(A26=\"\",\"\",VLOOKUP(A26,list!$A:$D,4,FALSE))","v":""},null,"","",{"$f":"IF(A26=\"\",\"\",VLOOKUP(A26,list!$A:$G,7,FALSE))&\"\"","v":""}]
[null,{"$f":"IF(A27=\"\",\"\",VLOOKUP(A27,list!$A:$C,2,FALSE))","v":""},{"$f":"IF(A27=\"\",\"\",VLOOKUP(A27,list!$A:$C,3,FALSE))","v":""},{"$f":"IF(A27=\"\",\"\",VLOOKUP(A27,list!$A:$D,4,FALSE))","v":""},null,"","",{"$f":"IF(A27=\"\",\"\",VLOOKUP(A27,list!$A:$G,7,FALSE))&\"\"","v":""}]
[null,{"$f":"IF(A28=\"\",\"\",VLOOKUP(A28,list!$A:$C,2,FALSE))","v":""},{"$f":"IF(A28=\"\",\"\",VLOOKUP(A28,list!$A:$C,3,FALSE))","v":""},{"$f":"IF(A28=\"\",\"\",VLOOKUP(A28,list!$A:$D,4,FALSE))","v":""},null,"","",{"$f":"IF(A28=\"\",\"\",VLOOKUP(A28,list!$A:$G,7,FALSE))&\"\"","v":""}]
[null,{"$f":"IF(A29=\"\",\"\",VLOOKUP(A29,list!$A:$C,2,FALSE))","v":""},{"$f":"IF(A29=\"\",\"\",VLOOKUP(A29,list!$A:$C,3,FALSE))","v":""},{"$f":"IF(A29=\"\",\"\",VLOOKUP(A29,list!$A:$D,4,FALSE))","v":""},null,"","",{"$f":"IF(A29=\"\",\"\",VLOOKUP(A29,list!$A:$G,7,FALSE))&\"\"","v":""}]
[null,null,"合計数量",null,{"$f":"IF(SUM(E10:E29)=0,\"\",SUM(E10:E29))","v":""},"合計金額",{"$f":"IF(SUM(G10:G29)=0,\"\",SUM(G10:G29))","v":""}]
[null,null,null,null,null,"消費税",{"$f":"IF(SUM(G10:G29)=0,\"\",SUM(G10:G29)*0.1)","v":""}]
[null,null,null,null,null,"総計金額",{"$f":"IF(SUM(G10:G29)=0,\"\",SUM(G30:G31))","v":""}]
["お客様名",null,"電話番号"]
["納品先",null,"電話番号"]
["納品先住所",null,"その他"]

{"sheet":"list","index":1,"n_rows":956,"n_cols":7,"rows_kept":956,"cut":false,"hidden":false,"merged":[]}
[null,null,null,null,null,null,"〇継続△廃盤在有×廃盤0"]
["商品コード(+色番)","商品名","上代価格","発注単位","JANコード","寸法","廃盤"]
["02899301","クーケカクプレート　ナチュラル",1200,1,"4543959396016","19.5x13.5xh5.0cm"]
["02899061","クーケカクプレート　ブラウン",1200,1,"4543959396030","19.5x13.5xh5.0cm"]
["02899101","クーケカクプレート　スノーホワイト",1200,1,"4543959396269","19.5x13.5xh5.0cm"]
["02899085","クーケカクプレート　グレー",1200,1,"4543959396047","19.5x13.5xh5.0cm","×"]
["02899191","クーケカクプレート　ブラック",1200,1,"4543959396214","19.5x13.5xh5.0cm"]
["02899471","クーケカクプレート　イエロー",1200,1,"4543959396108","19.5x13.5xh5.0cm"]
["02899011","クーケカクプレート　バレンシア",1200,1,"4543959397105","19.5x13.5xh5.0cm"]
["02899791","クーケカクプレート　レッド",1200,1,"4543959396078","19.5x13.5xh5.0cm"]
["02899201","クーケカクプレート　パープル",1200,1,"4543959396115","19.5x13.5xh5.0cm"]
["02899371","クーケカクプレート　グリーン",1200,1,"4543959396092","19.5x13.5xh5.0cm"]
["02899781","クーケカクプレート　ブルー",1200,1,"4543959397235","19.5x13.5xh5.0cm"]
["02873301","ブランジェリーオーバルバスケット　ナチュラル",1250,1,"4543959395019","22.5x16.0xh6.5cm"]
["02873041","ブランジェリーオーバルバスケット　ベージュ",1250,1,"4543959395033","22.5x16.0xh6.5cm","×"]
["02873061","ブランジェリーオーバルバスケット　ブラウン",1250,1,"4543959395033","22.5x16.0xh6.5cm"]
["02873101","ブランジェリーオーバルバスケット　スノーホワイト",1250,1,"4543959395262","22.5x16.0xh6.5cm"]
["02873085","ブランジェリーオーバルバスケット　グレー",1250,1,"4543959395040","22.5x16.0xh6.5cm","×"]
["02873191","ブランジェリーオーバルバスケット　ブラック",1250,1,"4543959395217","22.5x16.0xh6.5cm"]
["02873471","ブランジェリーオーバルバスケット　イエロー",1250,1,"4543959395101","22.5x16.0xh6.5cm"]
["02873011","ブランジェリーオーバルバスケット　バレンシア",1250,1,"4543959397112","22.5x16.0xh6.5cm"]
["02873791","ブランジェリーオーバルバスケット　レッド",1250,1,"4543959395071","22.5x16.0xh6.5cm"]
["02873201","ブランジェリーオーバルバスケット　パープル",1250,1,"4543959395118","22.5x16.0xh6.5cm"]
["02873371","ブランジェリーオーバルバスケット　グリーン",1250,1,"4543959395095","22.5x16.0xh6.5cm"]
["02873781","ブランジェリーオーバルバスケット　ブルー",1250,1,"4543959397242","22.5x16.0xh6.5cm"]
["02862301","シュガーボウル　ナチュラル",800,1,"4543959394012","φ10.0xh4.5cm"]
["02862041","シュガーボウル　ベージュ",800,1,"4543959394029","φ10.0xh4.5cm","△"]
["02862061","シュガーボウル　ブラウン",800,1,"4543959394036","φ10.0xh4.5cm"]
["02862541","シュガーボウル　アイボリー",800,1,"4543959394067","φ10.0xh4.5cm","△"]
["02862101","シュガーボウル　スノーホワイト",800,1,"4543959394265","φ10.0xh4.5cm"]
["02862085","シュガーボウル　グレー",800,1,"4543959394043","φ10.0xh4.5cm","△"]
["02862191","シュガーボウル　ブラック",800,1,"4543959394210","φ10.0xh4.5cm"]
["02862471","シュガーボウル　イエロー",800,1,"4543959394104","φ10.0xh4.5cm"]
["02862011","シュガーボウル　バレンシア",800,1,"4543959397129","φ10.0xh4.5cm"]
["02862791","シュガーボウル　レッド",800,1,"4543959394074","φ10.0xh4.5cm"]
["02862201","シュガーボウル　パープル",800,1,"4543959394111","φ10.0xh4.5cm"]
["02862371","シュガーボウル　グリーン",800,1,"4543959394098","φ10.0xh4.5cm"]
["02862781","シュガーボウル　ブルー",800,1,"4543959397259","φ10.0xh4.5cm"]
["02849301","コンフィチュールバスケット　ナチュラル",750,1,"4543959290017","13.0x8.5xh6.5cm "]
["02849041","コンフィチュールバスケット　ベージュ",750,1,"4543959290024","13.0x8.5xh6.5cm ","×"]
["02849061","コンフィチュールバスケット　ブラウン",750,1,"4543959290062","13.0x8.5xh6.5cm "]
["02849101","コンフィチュールバスケット　スノーホワイト",750,1,"4543959290260","13.0x8.5xh6.5cm "]
["02849085","コンフィチュールバスケット　グレー",750,1,"4543959290048","13.0x8.5xh6.5cm ","×"]
["02849191","コンフィチュールバスケット　ブラック",750,1,"4543959290215","13.0x8.5xh6.5cm "]
["02849471","コンフィチュールバスケット　イエロー",750,1,"4543959290109","13.0x8.5xh6.5cm "]
["02849011","コンフィチュールバスケット　バレンシア",750,1,"4543959397136","13.0x8.5xh6.5cm "]
["02849791","コンフィチュールバスケット　レッド",750,1,"4543959290079","13.0x8.5xh6.5cm "]
["02849201","コンフィチュールバスケット　パープル",750,1,"4543959290116","13.0x8.5xh6.5cm "]
["02849371","コンフィチュールバスケット　グリーン",750,1,"4543959290093","13.0x8.5xh6.5cm "]
["02849781","コンフィチュールバスケット　ブルー",750,1,"4543959397266","13.0x8.5xh6.5cm "]
["02463301","プチブレッドボウル　ナチュラル",1000,1,"4543959306015","φ12.0xh5.5cm "]
["02463061","プチブレッドボウル　ブラウン",1000,1,"4543959306039","φ12.0xh5.5cm "]
["02463541","プチブレッドボウル　アイボリー",1000,1,"4543959306060","φ12.0xh5.5cm ","×"]
["02463101","プチブレッドボウル　スノーホワイト",1000,1,"4543959306268","φ12.0xh5.5cm "]
["02463085","プチブレッドボウル　グレー",1000,1,"4543959306046","φ12.0xh5.5cm ","△"]
["02463191","プチブレッドボウル　ブラック",1000,1,"4543959306213","φ12.0xh5.5cm "]
["02463471","プチブレッドボウル　イエロー",1000,1,"4543959306107","φ12.0xh5.5cm "]
["02463011","プチブレッドボウル　バレンシア",1000,1,"4543959397143","φ12.0xh5.5cm "]
["02463791","プチブレッドボウル　レッド",1000,1,"4543959306077","φ12.0xh5.5cm "]
["02463201","プチブレッドボウル　パープル",1000,1,"4543959306114","φ12.0xh5.5cm "]
["02463371","プチブレッドボウル　グリーン",1000,1,"4543959306091","φ12.0xh5.5cm "]
["02463781","プチブレッドボウル　ブルー",1000,1,"4543959397273","φ12.0xh5.5cm "]
["02874301","エッグボウル　ナチュラル",1150,1,"4543959392018","φ16.0xh8.0cm"]
["02874061","エッグボウル　ブラウン",1150,1,"4543959392032","φ16.0xh8.0cm"]
["02874541","エッグボウル　アイボリー",1150,1,"4543959392063","φ16.0xh8.0cm","×"]
["02874101","エッグボウル　スノーホワイト",1150,1,"4543959392261","φ16.0xh8.0cm"]
["02874085","エッグボウル　グレー",1150,1,"4543959392049","φ16.0xh8.0cm","×"]
["02874191","エッグボウル　ブラック",1150,1,"4543959392216","φ16.0xh8.0cm"]
["02874471","エッグボウル　イエロー",1150,1,"4543959392100","φ16.0xh8.0cm"]
["02874011","エッグボウル　バレンシア",1150,1,"4543959397150","φ16.0xh8.0cm"]
["02874791","エッグボウル　レッド",1150,1,"4543959392070","φ16.0xh8.0cm"]
["02874201","エッグボウル　パープル",1150,1,"4543959392117","φ16.0xh8.0cm"]
["02874371","エッグボウル　グリーン",1150,1,"4543959392094","φ16.0xh8.0cm"]
["02874781","エッグボウル　ブルー",1150,1,"4543959397280","φ16.0xh8.0cm"]
["02964301","テーブルスクエアバスケットＳ　ナチュラル",1500,1,"4543959303014","21.0x21.0xh7.5cm "]
["02964041","テーブルスクエアバスケットＳ　ベージュ",1500,1,"4543959303021","21.0x21.0xh7.5cm ","△"]
["02964061","テーブルスクエアバスケットＳ　ブラウン",1500,1,"4543959303038","21.0x21.0xh7.5cm "]
["02964541","テーブルスクエアバスケットＳ　アイボリー",1500,1,"4543959303069","21.0x21.0xh7.5cm ","△"]
["02964101","テーブルスクエアバスケットＳ　スノーホワイト",1500,1,"4543959303267","21.0x21.0xh7.5cm "]
["02964085","テーブルスクエアバスケットＳ　グレー",1500,1,"4543959303045","21.0x21.0xh7.5cm ","△"]
["02964191","テーブルスクエアバスケットＳ　ブラック",1500,1,"4543959303212","21.0x21.0xh7.5cm "]
["02964471","テーブルスクエアバスケットＳ　イエロー",1500,1,"4543959303106","21.0x21.0xh7.5cm "]
["02964011","テーブルスクエアバスケットＳ　バレンシア",1500,1,"4543959397167","21.0x21.0xh7.5cm "]
["02964791","テーブルスクエアバスケットＳ　レッド",1500,1,"4543959303076","21.0x21.0xh7.5cm "]
["02964201","テーブルスクエアバスケットＳ　パープル",1500,1,"4543959303113","21.0x21.0xh7.5cm "]
["02964371","テーブルスクエアバスケットＳ　グリーン",1500,1,"4543959303090","21.0x21.0xh7.5cm "]
["02964781","テーブルスクエアバスケットＳ　ブルー",1500,1,"4543959397297","21.0x21.0xh7.5cm "]
["02965301","テーブルスクエアバスケットＭ　ナチュラル",1800,1,"4543959304011","23.0x23.0xh9.0cm "]
["02965041","テーブルスクエアバスケットＭ　ベージュ",1800,1,"4543959304028","23.0x23.0xh9.0cm ","△"]
["02965061","テーブルスクエアバスケットＭ　ブラウン",1800,1,"4543959304035","23.0x23.0xh9.0cm "]
["02965541","テーブルスクエアバスケットＭ　アイボリー",1800,1,"4543959304066","23.0x23.0xh9.0cm ","△"]
["02965101","テーブルスクエアバスケットＭ　スノーホワイト",1800,1,"4543959304264","23.0x23.0xh9.0cm "]
["02965085","テーブルスクエアバスケットＭ　グレー",1800,1,"4543959304042","23.0x23.0xh9.0cm ","△"]
["02965191","テーブルスクエアバスケットＭ　ブラック",1800,1,"4543959304219","23.0x23.0xh9.0cm "]
["02965471","テーブルスクエアバスケットＭ　イエロー",1800,1,"4543959304103","23.0x23.0xh9.0cm "]
["02965011","テーブルスクエアバスケットＭ　バレンシア",1800,1,"4543959397174","23.0x23.0xh9.0cm "]
["02965791","テーブルスクエアバスケットＭ　レッド",1800,1,"4543959304073","23.0x23.0xh9.0cm "]
["02965201","テーブルスクエアバスケットＭ　パープル",1800,1,"4543959304110","23.0x23.0xh9.0cm "]
["02965371","テーブルスクエアバスケットＭ　グリーン",1800,1,"4543959304097","23.0x23.0xh9.0cm "]
["02965781","テーブルスクエアバスケットＭ　ブルー",1800,1,"4543959397303","23.0x23.0xh9.0cm "]
["02848301","プチラウンドプレート　ナチュラル",850,1,"4543959291014","φ15.5xh3.5cm"]
["02848061","プチラウンドプレート　ブラウン",850,1,"4543959291038","φ15.5xh3.5cm"]
["02848541","プチラウンドプレート　アイボリー",850,1,"4543959291069","φ15.5xh3.5cm","×"]
["02848101","プチラウンドプレート　スノーホワイト",850,1,"4543959291267","φ15.5xh3.5cm"]
["02848085","プチラウンドプレート　グレー",850,1,"4543959291045","φ15.5xh3.5cm","×"]
["02848191","プチラウンドプレート　ブラック",850,1,"4543959291212","φ15.5xh3.5cm"]
["02848471","プチラウンドプレート　イエロー",850,1,"4543959291106","φ15.5xh3.5cm"]
["02848011","プチラウンドプレート　バレンシア",850,1,"4543959397181","φ15.5xh3.5cm"]
["02848791","プチラウンドプレート　レッド",850,1,"4543959291076","φ15.5xh3.5cm"]
["02848201","プチラウンドプレート　パープル",850,1,"4543959291113","φ15.5xh3.5cm"]
["02848371","プチラウンドプレート　グリーン",850,1,"4543959291090","φ15.5xh3.5cm"]
["02848781","プチラウンドプレート　ブルー",850,1,"4543959397310","φ15.5xh3.5cm"]
["02544301","プチベッセル　ナチュラル",1200,1,"4543959544011","15.5x8.0xh4.0cm"]
["02544041","プチベッセル　ベージュ",1200,1,"4543959544028","15.5x8.0xh4.0cm","△"]
["02544061","プチベッセル　ブラウン",1200,1,"4543959544035","15.5x8.0xh4.0cm"]
["02544101","プチベッセル　スノーホワイト",1200,1,"4543959544264","15.5x8.0xh4.0cm"]
["02544085","プチベッセル　グレー",1200,1,"4543959544042","15.5x8.0xh4.0cm","×"]
["02544191","プチベッセル　ブラック",1200,1,"4543959544219","15.5x8.0xh4.0cm"]
["02544471","プチベッセル　イエロー",1200,1,"4543959544103","15.5x8.0xh4.0cm"]
["02544011","プチベッセル　オレンジ",1200,1,"4543959397198","15.5x8.0xh4.0cm"]
["02544791","プチベッセル　レッド",1200,1,"4543959544073","15.5x8.0xh4.0cm"]
["02544201","プチベッセル　バレンシア",1200,1,"4543959544110","15.5x8.0xh4.0cm"]
["02544371","プチベッセル　グリーン",1200,1,"4543959544097","15.5x8.0xh4.0cm"]
["02544781","プチベッセル　ブルー",1200,1,"4543959397327","15.5x8.0xh4.0cm"]
["02961301","テーブルウイングバスケット　ナチュラル",1650,1,"4543959397365","23.5x18.0xh6.0/8.0cm"]
["02961041","テーブルウイングバスケット　ベージュ",1650,1,"4543959397372","23.5x18.0xh6.0/8.0cm","×"]
["02961061","テーブルウイングバスケット　ブラウン",1650,1,"4543959397389","23.5x18.0xh6.0/8.0cm"]
["02961541","テーブルウイングバスケット　アイボリー",1650,1,"4543959397396","23.5x18.0xh6.0/8.0cm","×"]
["02961101","テーブルウイングバスケット　スノーホワイト",1650,1,"4543959397402","23.5x18.0xh6.0/8.0cm"]
["02961085","テーブルウイングバスケット　グレー",1650,1,"4543959397419","23.5x18.0xh6.0/8.0cm","×"]
["02961191","テーブルウイングバスケット　ブラック",1650,1,"4543959397426","23.5x18.0xh6.0/8.0cm"]
["02961471","テーブルウイングバスケット　イエロー",1650,1,"4543959397433","23.5x18.0xh6.0/8.0cm"]
["02961011","テーブルウイングバスケット　バレンシア",1650,1,"4543959397440","23.5x18.0xh6.0/8.0cm"]
["02961791","テーブルウイングバスケット　レッド",1650,1,"4543959397457","23.5x18.0xh6.0/8.0cm"]
["02961201","テーブルウイングバスケット　パープル",1650,1,"4543959397464","23.5x18.0xh6.0/8.0cm"]
["02961371","テーブルウイングバスケット　グリーン",1650,1,"4543959397471","23.5x18.0xh6.0/8.0cm"]
["02961781","テーブルウイングバスケット　ブルー",1650,1,"4543959397488","23.5x18.0xh6.0/8.0cm"]
["02361301","テーブルカクバスケット　ナチュラル",1750,1,"4543959397495","26.5x19.0xh7.0cm"]
["02361061","テーブルカクバスケット　ブラウン",1750,1,"4543959397518","26.5x19.0xh7.0cm"]
["02361101","テーブルカクバスケット　スノーホワイト",1750,1,"4543959397532","26.5x19.0xh7.0cm"]
["02361085","テーブルカクバスケット　グレー",1750,1,"4543959397549","26.5x19.0xh7.0cm","×"]
["02361191","テーブルカクバスケット　ブラック",1750,1,"4543959397556","26.5x19.0xh7.0cm"]
["02361471","テーブルカクバスケット　イエロー",1750,1,"4543959397563","26.5x19.0xh7.0cm"]
["02361011","テーブルカクバスケット　バレンシア",1750,1,"4543959397570","26.5x19.0xh7.0cm"]
["02361791","テーブルカクバスケット　レッド",1750,1,"4543959397587","26.5x19.0xh7.0cm"]
["02361201","テーブルカクバスケット　パープル",1750,1,"4543959397594","26.5x19.0xh7.0cm"]
["02361371","テーブルカクバスケット　グリーン",1750,1,"4543959397600","26.5x19.0xh7.0cm"]
["02361781","テーブルカクバスケット　ブルー",1750,1,"4543959397617","26.5x19.0xh7.0cm"]
["02934301","テーブルオーバルバスケット　ナチュラル",1950,1,"4543959397624","26.0x18.5xh9.0cm"]
["02934041","テーブルオーバルバスケット　ベージュ",1950,1,"4543959397631","26.0x18.5xh9.0cm","△"]
["02934061","テーブルオーバルバスケット　ブラウン",1950,1,"4543959397648","26.0x18.5xh9.0cm"]
["02934541","テーブルオーバルバスケット　アイボリー",1950,1,"4543959397655","26.0x18.5xh9.0cm","×"]
["02934101","テーブルオーバルバスケット　スノーホワイト",1950,1,"4543959397662","26.0x18.5xh9.0cm"]
["02934085","テーブルオーバルバスケット　グレー",1950,1,"4543959397679","26.0x18.5xh9.0cm","×"]
["02934191","テーブルオーバルバスケット　ブラック",1950,1,"4543959397686","26.0x18.5xh9.0cm"]
["02934471","テーブルオーバルバスケット　イエロー",1950,1,"4543959397693","26.0x18.5xh9.0cm"]
["02934011","テーブルオーバルバスケット　バレンシア",1950,1,"4543959397709","26.0x18.5xh9.0cm"]
["02934791","テーブルオーバルバスケット　レッド",1950,1,"4543959397716","26.0x18.5xh9.0cm"]
["02934201","テーブルオーバルバスケット　パープル",1950,1,"4543959397723","26.0x18.5xh9.0cm"]
["02934371","テーブルオーバルバスケット　グリーン",1950,1,"4543959397730","26.0x18.5xh9.0cm"]
["02934781","テーブルオーバルバスケット　ブルー",1950,1,"4543959397747","26.0x18.5xh9.0cm"]
["02157301","カトラリートレーＳ　ナチュラル",1250,1,"4543959157013","27.5x10.0xh4.5cm"]
["02157041","カトラリートレーＳ　ベージュ",1250,1,"4543959157020","27.5x10.0xh4.5cm","△"]
["02157061","カトラリートレーＳ　ブラウン",1250,1,"4543959157037","27.5x10.0xh4.5cm"]
["02157541","カトラリートレーＳ　アイボリー",1250,1,"4543959157068","27.5x10.0xh4.5cm","△"]
["02157101","カトラリートレーＳ　スノーホワイト",1250,1,"4543959157266","27.5x10.0xh4.5cm"]
["02157191","カトラリートレーＳ　ブラック",1250,1,"4543959157211","27.5x10.0xh4.5cm","△"]
["02158301","カトラリートレーＬ　ナチュラル",1400,1,"4543959158010","27.5x10.0xh6.0cm"]
["02158061","カトラリートレーＬ　ブラウン",1400,1,"4543959158034","27.5x10.0xh6.0cm"]
["02158541","カトラリートレーＬ　アイボリー",1400,1,"4543959158065","27.5x10.0xh6.0cm","×"]
["02158101","カトラリートレーＬ　スノーホワイト",1400,1,"4543959158263","27.5x10.0xh6.0cm"]
["02158191","カトラリートレーＬ　ブラック",1400,1,"4543959158218","27.5x10.0xh6.0cm","△"]
["02844301","ビスキュイバスケット　ナチュラル",1550,1,"4543959393015","φ22.0xh5.0cm"]
["02844061","ビスキュイバスケット　ブラウン",1550,1,"4543959393039","φ22.0xh5.0cm"]
["02103301","ボウルＳ　ナチュラル",1600,1,"4543959103010","φ24.0xh9.0cm"]
["02103041","ボウルＳ　ベージュ",1600,1,"4543959103027","φ24.0xh9.0cm","△"]
["02103061","ボウルＳ　ブラウン",1600,1,"4543959103034","φ24.0xh9.0cm"]
["02103541","ボウルＳ　アイボリー",1600,1,"4543959103065","φ24.0xh9.0cm","△"]
["02103471","ボウルＳ　イエロー",1600,1,"4543959103102","φ24.0xh9.0cm"]
["02103371","ボウルＳ　グリーン",1600,1,"4543959103096","φ24.0xh9.0cm"]
["02103791","ボウルＳ　レッド",1600,1,"4543959103072","φ24.0xh9.0cm"]
["02109301","オーバルバスケットＳ　ナチュラル",1600,1,"4543959109029","28.0x17.0xh8.0cm"]
["02109041","オーバルバスケットＳ　ベージュ",1600,1,"4543959109029","28.0x17.0xh8.0cm","×"]
["02109061","オーバルバスケットＳ　ブラウン",1600,1,"4543959109036","28.0x17.0xh8.0cm"]
["02109541","オーバルバスケットＳ　アイボリー",1600,1,"4543959109067","28.0x17.0xh8.0cm","×"]
["02109471","オーバルバスケットＳ　イエロー",1600,1,"4543959109104","28.0x17.0xh8.0cm"]
["02109371","オーバルバスケットＳ　グリーン",1600,1,"4543959109098","28.0x17.0xh8.0cm"]
["02109791","オーバルバスケットＳ　レッド",1600,1,"4543959109074","28.0x17.0xh8.0cm"]
["02560301","オーバルバスケットM　ナチュラル",1650,1,"4543959560011","26.0x21.0xh8.0cm"]
["02560061","オーバルバスケットＭ　ブラウン",1650,1,"4543959560035","26.0x21.0xh8.0cm"]
["02560541","オーバルバスケットＭ　アイボリー",1650,1,"4543959560066","26.0x21.0xh8.0cm","×"]
["02560471","オーバルバスケットＭ　イエロー",1650,1,"4543959560103","26.0x21.0xh8.0cm"]
["02560371","オーバルバスケットＭ　グリーン",1650,1,"4543959560097","26.0x21.0xh8.0cm"]
["02560791","オーバルバスケットＭ　レッド",1650,1,"4543959560073","26.0x21.0xh8.0cm"]
["02200301","カクバスケット　ナチュラル",2100,1,"4543959200016","31.0x23.0xh10.0cm"]
["02200061","カクバスケット　ブラウン",2100,1,"4543959200030","31.0x23.0xh10.0cm"]
["02200471","カクバスケット　イエロー",2100,1,"4543959200108","31.0x23.0xh10.0cm"]
["02200371","カクバスケット　グリーン",2100,1,"4543959200092","31.0x23.0xh10.0cm"]
["02200791","カクバスケット　レッド",2100,1,"4543959200078","31.0x23.0xh10.0cm"]
["02105301","ウイングバスケット　ナチュラル",2300,1,"4543959105014","30.0x21.0xh11.0cm"]
{"$rows_left_out":757}
{"sheet":"ﾌﾞﾛｯｸ解除方法","index":2,"n_rows":4,"n_cols":1,"rows_kept":4,"cut":false,"hidden":false,"merged":[]}
[]
["ダウンロードした発注書ファイルをデスクトップ上に移動してください。"]
["発注書ファイルのアイコンを右クリックし、プロパティを選択してください。"]
["下の画面の「許可する」にチェックを入れ、「OK」をクリックしてください。"]